Reaction Details
TargetCannabinoid receptor 1
LigandBDBM50177164
Substrate/Competitorn/a
Meas. Tech.ChEMBL_431067 (CHEMBL917772)
Ki 1500±n/a nM
Citation Muccioli, GGWouters, JScriba, GKPoppitz, WPoupaert, JHLambert, DM 1-Benzhydryl-3-phenylurea and 1-benzhydryl-3-phenylthiourea derivatives: new templates among the CB1 cannabinoid receptor inverse agonists. J Med Chem48:7486-90 (2005) 
 
Cannabinoid receptor 1
Name:Cannabinoid receptor 1
Type:G Protein-Coupled Receptor (GPCR)
Mol. Mass.:52868.96
Organism:Homo sapiens (Human)
Description:P21554
Residue:472
BDBM50177164
NameBDBM50177164
Synonyms:1-[bis(4-bromophenyl)methyl]-3-(4-chlorophenyl)thiourea | CHEMBL224697
TypeSmall organic molecule
Emp. Form.C20H15Br2ClN2S
Mol. Mass.510.673
SMILESClc1ccc(NC(=S)NC(c2ccc(Br)cc2)c2ccc(Br)cc2)cc1