Reaction Details
TargetShikimate kinase
LigandBDBM50370962
Substrate/Competitorn/a
Meas. Tech.ChEMBL_432672 (CHEMBL919243)
Ki 9480±n/a nM
Citation Han, CZhang, JChen, LChen, KShen, XJiang, H Discovery of Helicobacter pylori shikimate kinase inhibitors: bioassay and molecular modeling. Bioorg Med Chem15:656-62 (2006) 
 
Shikimate kinase
Name:Shikimate kinase
Type:PROTEIN
Mol. Mass.:18412.75
Organism:Helicobacter pylori (strain ATCC 700392 / 26695) (Campylobacterpylori)
Description:ChEMBL_432674
Residue:162
BDBM50370962
NameBDBM50370962
Synonyms:CHEMBL223867
TypeSmall organic molecule
Emp. Form.C27H23NO6S2
Mol. Mass.521.605
SMILESCOc1cc(C=O)ccc1OCc1ccccc1COc1ccc(C=C2SC(S)=NC2=O)cc1OC