Reaction Details
TargetDelta-type opioid receptor
LigandBDBM50209644
Substrate/Competitorn/a
Meas. Tech.ChEMBL_434305 (CHEMBL917884)
Ki 0.2±n/a nM
Citation Duval, RAAllmon, RLLever, JR Indium-labeled macrocyclic conjugates of naltrindole: high-affinity radioligands for in vivo studies of peripheral delta opioid receptors. J Med Chem50:2144-56 (2007) 
 
Delta-type opioid receptor
Name:Delta-type opioid receptor
Type:Enzyme Catalytic Domain
Mol. Mass.:40577.25
Organism:MOUSE
Description:P32300
Residue:372
BDBM50209644
NameBDBM50209644
Synonyms:17-cyclopropylmethyl)-6,7-didehydro-4,5alpha-epoxy-3,14-dihydroxy-1'-(10'''-[6''-hexyl]-[1''',4''',7''',10'''-tetraazacyclododecane-1''',4''',7'''-triacetic acid])indolo[6,7:2',3']morphinan | CHEMBL426750
TypeSmall organic molecule
Emp. Form.C45H60N6O9
Mol. Mass.828.9927
SMILESOC(=O)CN1CCN(CCCCCn2c3[C@H]4Oc5c6c(C[C@H]7N(CC8CC8)CC[C@@]46[C@@]7(O)Cc3c3ccccc23)ccc5O)CCN(CC(O)=O)CCN(CC(O)=O)CC1