Reaction Details
TargetCarbonic anhydrase 2
LigandBDBM10883
Substrate/Competitorn/a
Meas. Tech.ChEMBL_435725 (CHEMBL904078)
Ki 38±n/a nM
Citation Nuti, EOrlandini, ENencetti, SRossello, AInnocenti, AScozzafava, ASupuran, CT Carbonic anhydrase and matrix metalloproteinase inhibitors. Inhibition of human tumor-associated isozymes IX and cytosolic isozyme I and II with sulfonylated hydroxamates. Bioorg Med Chem15:2298-311 (2007) 
 
Carbonic anhydrase 2
Name:Carbonic anhydrase 2
Type:Enzyme
Mol. Mass.:29250.71
Organism:Homo sapiens (Human)
Description:P00918
Residue:260
BDBM10883
NameBDBM10883
Synonyms:4,5-dichlorobenzene-1,3-disulfonamide Dichlorophenamide Dichlorophenamide, DCP US10172837, Dichlorphenamide | sulfonamide 4
TypeSmall organic molecule
Emp. Form.C6H6Cl2N2O4S2
Mol. Mass.305.159
SMILESNS(=O)(=O)c1cc(Cl)c(Cl)c(c1)S(N)(=O)=O