Reaction Details
TargetAdenosine receptor A2b
LigandBDBM50205583
Substrate/Competitorn/a
Meas. Tech.ChEMBL_435759 (CHEMBL904113)
EC50 150±n/a nM
Citation Baraldi, PGPreti, DTabrizi, MAFruttarolo, FSaponaro, GBaraldi, SRomagnoli, RMoorman, ARGessi, SVarani, KBorea, PA N(6)-[(hetero)aryl/(cyclo)alkyl-carbamoyl-methoxy-phenyl]-(2-chloro)-5'-N-ethylcarboxamido-adenosines: the first example of adenosine-related structures with potent agonist activity at the human A(2B) adenosine receptor. Bioorg Med Chem15:2514-27 (2007) 
 
Adenosine receptor A2b
Name:Adenosine receptor A2b
Type:G Protein-Coupled Receptor (GPCR)
Mol. Mass.:36341.22
Organism:Homo sapiens (Human)
Description:n/a
Residue:332
BDBM50205583
NameBDBM50205583
Synonyms:(2S,3S,4R,5R)-5-(6-(4-(2-(benzylamino)-2-oxoethoxy)phenylamino)-9H-purin-9-yl)-N-ethyl-3,4-dihydroxy-tetrahydrofuran-2-carboxamide CHEMBL375501
TypeSmall organic molecule
Emp. Form.C27H29N7O6
Mol. Mass.547.5625
SMILESCCNC(=O)[C@H]1O[C@H]([C@H](O)[C@@H]1O)n1cnc2c(Nc3ccc(OCC(=O)NCc4ccccc4)cc3)ncnc12