Reaction Details
TargetHeme oxygenase 2
LigandBDBM50207205
Substrate/Competitorn/a
Meas. Tech.ChEMBL_435912 (CHEMBL905313)
IC50 1800±n/a nM
Citation Roman, GRiley, JGVlahakis, JZKinobe, RTBrien, JFNakatsu, KSzarek, WA Heme oxygenase inhibition by 2-oxy-substituted 1-(1H-imidazol-1-yl)-4-phenylbutanes: effect of halogen substitution in the phenyl ring. Bioorg Med Chem15:3225-34 (2007) 
 
Heme oxygenase 2
Name:Heme oxygenase 2
Type:Enzyme
Mol. Mass.:35754.99
Organism:Rattus norvegicus (rat)
Description:HO-2 obtained from rat brain was used in enzyme assays.
Residue:315
BDBM50207205
NameBDBM50207205
Synonyms:1-(1H-imidazol-1-yl)-4-(4-iodophenyl)-2-butanone hydrochloride | CHEMBL540883
TypeSmall organic molecule
Emp. Form.C13H13IN2O
Mol. Mass.340.1596
SMILESIc1ccc(CCC(=O)Cn2ccnc2)cc1