Reaction Details
TargetHeme oxygenase 2
LigandBDBM50207201
Substrate/Competitorn/a
Meas. Tech.ChEMBL_435912 (CHEMBL905313)
IC50 2600±n/a nM
Citation Roman, GRiley, JGVlahakis, JZKinobe, RTBrien, JFNakatsu, KSzarek, WA Heme oxygenase inhibition by 2-oxy-substituted 1-(1H-imidazol-1-yl)-4-phenylbutanes: effect of halogen substitution in the phenyl ring. Bioorg Med Chem15:3225-34 (2007) 
 
Heme oxygenase 2
Name:Heme oxygenase 2
Type:Enzyme
Mol. Mass.:35754.99
Organism:Rattus norvegicus (rat)
Description:HO-2 obtained from rat brain was used in enzyme assays.
Residue:315
BDBM50207201
NameBDBM50207201
Synonyms:4-(4-bromophenyl)-1-(1H-imidazol-1-yl)-2-butanol hydrochloride | CHEMBL536745
TypeSmall organic molecule
Emp. Form.C13H15BrN2O
Mol. Mass.295.175
SMILESOC(CCc1ccc(Br)cc1)Cn1ccnc1