Reaction Details
TargetHeme oxygenase 2
LigandBDBM50207199
Substrate/Competitorn/a
Meas. Tech.ChEMBL_435912 (CHEMBL905313)
IC50>100000±n/a nM
Citation Roman, GRiley, JGVlahakis, JZKinobe, RTBrien, JFNakatsu, KSzarek, WA Heme oxygenase inhibition by 2-oxy-substituted 1-(1H-imidazol-1-yl)-4-phenylbutanes: effect of halogen substitution in the phenyl ring. Bioorg Med Chem15:3225-34 (2007) 
 
Heme oxygenase 2
Name:Heme oxygenase 2
Type:Enzyme
Mol. Mass.:35754.99
Organism:Rattus norvegicus (rat)
Description:HO-2 obtained from rat brain was used in enzyme assays.
Residue:315
BDBM50207199
NameBDBM50207199
Synonyms:1-((2-(2-(4-bromophenyl)ethyl)-1,3-dioxolan-2-yl)methyl)-1H-imidazole hydrochloride | CHEMBL539857
TypeSmall organic molecule
Emp. Form.C15H17BrN2O2
Mol. Mass.337.212
SMILESBrc1ccc(CCC2(Cn3ccnc3)OCCO2)cc1