Reaction Details
TargetEnoyl-acyl-carrier protein reductase
LigandBDBM8425
Substrate/Competitorn/a
Meas. Tech.ChEMBL_436469 (CHEMBL904776)
Ki 510±n/a nM
Citation Kumar, GParasuraman, PSharma, SKBanerjee, TKarmodiya, KSurolia, NSurolia, A Discovery of a rhodanine class of compounds as inhibitors of Plasmodium falciparum enoyl-acyl carrier protein reductase. J Med Chem50:2665-75 (2007) 
 
Enoyl-acyl-carrier protein reductase
Name:Enoyl-acyl-carrier protein reductase
Synonyms:n/a
Type:PROTEIN
Mol. Mass.:49770.86
Organism:Plasmodium falciparum
Description:ChEMBL_795989
Residue:432
BDBM8425
NameBDBM8425
TypeSmall organic molecule
Emp. Form.C14H7Cl2NO2S2
Mol. Mass.356.247
SMILESClc1ccc(cc1Cl)-c1ccc(\C=C2/SC(=S)NC2=O)o1