Reaction Details
TargetEnoyl-acyl-carrier protein reductase
LigandBDBM50211892
Substrate/Competitorn/a
Meas. Tech.ChEMBL_436468 (CHEMBL904777)
IC50 10000±n/a nM
Citation Kumar, GParasuraman, PSharma, SKBanerjee, TKarmodiya, KSurolia, NSurolia, A Discovery of a rhodanine class of compounds as inhibitors of Plasmodium falciparum enoyl-acyl carrier protein reductase. J Med Chem50:2665-75 (2007) 
 
Enoyl-acyl-carrier protein reductase
Name:Enoyl-acyl-carrier protein reductase
Synonyms:n/a
Type:PROTEIN
Mol. Mass.:49770.86
Organism:Plasmodium falciparum
Description:ChEMBL_795989
Residue:432
BDBM50211892
NameBDBM50211892
TypeSmall organic molecule
Emp. Form.C17H13NO3S2
Mol. Mass.343.42
SMILESCOc1ccc(\C=C2/SC(=S)N(C2=O)c2ccc(O)cc2)cc1