Reaction Details
TargetCannabinoid receptor 1
LigandBDBM50215224
Substrate/Competitorn/a
Meas. Tech.ChEMBL_437161 (CHEMBL906558)
Ki 60±n/a nM
Citation Brizzi, ACascio, MGBrizzi, VBisogno, TDinatolo, MTMartinelli, ATuccinardi, TDi Marzo, V Design, synthesis, binding, and molecular modeling studies of new potent ligands of cannabinoid receptors. Bioorg Med Chem15:5406-16 (2007) 
 
Cannabinoid receptor 1
Name:Cannabinoid receptor 1
Type:G Protein-Coupled Receptor (GPCR)
Mol. Mass.:52868.96
Organism:Homo sapiens (Human)
Description:P21554
Residue:472
BDBM50215224
NameBDBM50215224
Synonyms:12-(3-hydroxy-5-pentyl-phenoxy)-dodecanoic acid(2-hydroxy-ethyl)-amide | CHEMBL228404
TypeSmall organic molecule
Emp. Form.C25H43NO4
Mol. Mass.421.6132
SMILESCCCCCc1cc(O)cc(OCCCCCCCCCCCC(=O)NCCO)c1