Reaction Details
TargetCannabinoid receptor 2
LigandBDBM50215239
Substrate/Competitorn/a
Meas. Tech.ChEMBL_437162 (CHEMBL906559)
Ki 1420±n/a nM
Citation Brizzi, ACascio, MGBrizzi, VBisogno, TDinatolo, MTMartinelli, ATuccinardi, TDi Marzo, V Design, synthesis, binding, and molecular modeling studies of new potent ligands of cannabinoid receptors. Bioorg Med Chem15:5406-16 (2007) 
 
Cannabinoid receptor 2
Name:Cannabinoid receptor 2
Type:G Protein-Coupled Receptor (GPCR)
Mol. Mass.:39690.94
Organism:Homo sapiens (Human)
Description:P34972
Residue:360
BDBM50215239
NameBDBM50215239
Synonyms:12-(2-hexyl-5-hydroxy-phenoxy)-dodecanoic acid(2-hydroxy-ethyl)-amide | CHEMBL228508
TypeSmall organic molecule
Emp. Form.C26H45NO4
Mol. Mass.435.6398
SMILESCCCCCCc1c(O)cccc1OCCCCCCCCCCCC(=O)NCCO