Reaction Details
TargetCannabinoid receptor 1
LigandBDBM50215229
Substrate/Competitorn/a
Meas. Tech.ChEMBL_437161 (CHEMBL906558)
Ki 56±n/a nM
Citation Brizzi, ACascio, MGBrizzi, VBisogno, TDinatolo, MTMartinelli, ATuccinardi, TDi Marzo, V Design, synthesis, binding, and molecular modeling studies of new potent ligands of cannabinoid receptors. Bioorg Med Chem15:5406-16 (2007) 
 
Cannabinoid receptor 1
Name:Cannabinoid receptor 1
Type:G Protein-Coupled Receptor (GPCR)
Mol. Mass.:52868.96
Organism:Homo sapiens (Human)
Description:P21554
Residue:472
BDBM50215229
NameBDBM50215229
Synonyms:8-(4-hexyl-3-hydroxy-phenoxy)-octanoic acidcyclopropylamide | CHEMBL228510
TypeSmall organic molecule
Emp. Form.C23H37NO3
Mol. Mass.375.5448
SMILESCCCCCCc1ccc(OCCCCCCCC(=O)NC2CC2)cc1O