Reaction Details
TargetFatty-acid amide hydrolase 1 [30-579]
LigandBDBM50215243
Substrate/Competitorn/a
Meas. Tech.ChEMBL_437163 (CHEMBL906560)
IC50 50000±n/a nM
Citation Brizzi, ACascio, MGBrizzi, VBisogno, TDinatolo, MTMartinelli, ATuccinardi, TDi Marzo, V Design, synthesis, binding, and molecular modeling studies of new potent ligands of cannabinoid receptors. Bioorg Med Chem15:5406-16 (2007) 
 
Fatty-acid amide hydrolase 1 [30-579]
Name:Fatty-acid amide hydrolase 1 [30-579]
Type:Single-pass membrane protein; homodimer
Mol. Mass.:60474.00
Organism:Rattus norvegicus (rat)
Description:P97612 (aa 30-579)
Residue:550
BDBM50215243
NameBDBM50215243
Synonyms:11-(2-hexyl-5-hydroxy-phenoxy)-undecanoic acid(3-methoxy-4-hydroxy-phenyl)-amide | CHEMBL388393
TypeSmall organic molecule
Emp. Form.C31H47NO5
Mol. Mass.513.7086
SMILESCCCCCCc1c(O)cccc1OCCCCCCCCCCC(=O)NCc1ccc(OC)c(O)c1