Reaction Details
TargetCannabinoid receptor 1
LigandBDBM50215237
Substrate/Competitorn/a
Meas. Tech.ChEMBL_437165 (CHEMBL906563)
IC50>10000±n/a nM
Citation Brizzi, ACascio, MGBrizzi, VBisogno, TDinatolo, MTMartinelli, ATuccinardi, TDi Marzo, V Design, synthesis, binding, and molecular modeling studies of new potent ligands of cannabinoid receptors. Bioorg Med Chem15:5406-16 (2007) 
 
Cannabinoid receptor 1
Name:Cannabinoid receptor 1
Type:G Protein-Coupled Receptor (GPCR)
Mol. Mass.:52868.96
Organism:Homo sapiens (Human)
Description:P21554
Residue:472
BDBM50215237
NameBDBM50215237
Synonyms:12-(4-hexyl-3-hydroxy-phenoxy)-dodecanoic acid(2-hydroxy-ethyl)-amide | CHEMBL229820
TypeSmall organic molecule
Emp. Form.C26H45NO4
Mol. Mass.435.6398
SMILESCCCCCCc1ccc(OCCCCCCCCCCCC(=O)NCCO)cc1O