Reaction Details
TargetCannabinoid receptor 2
LigandBDBM50215235
Substrate/Competitorn/a
Meas. Tech.ChEMBL_437162 (CHEMBL906559)
Ki 310±n/a nM
Citation Brizzi, ACascio, MGBrizzi, VBisogno, TDinatolo, MTMartinelli, ATuccinardi, TDi Marzo, V Design, synthesis, binding, and molecular modeling studies of new potent ligands of cannabinoid receptors. Bioorg Med Chem15:5406-16 (2007) 
 
Cannabinoid receptor 2
Name:Cannabinoid receptor 2
Type:G Protein-Coupled Receptor (GPCR)
Mol. Mass.:39690.94
Organism:Homo sapiens (Human)
Description:P34972
Residue:360
BDBM50215235
NameBDBM50215235
Synonyms:12-(3-hydroxy-5-pentyl-phenoxy)-dodecanoic acidcyclopropylamide | CHEMBL228405
TypeSmall organic molecule
Emp. Form.C26H43NO3
Mol. Mass.417.6245
SMILESCCCCCc1cc(O)cc(OCCCCCCCCCCCC(=O)NC2CC2)c1