Reaction Details
TargetFatty-acid amide hydrolase 1 [30-579]
LigandBDBM50215246
Substrate/Competitorn/a
Meas. Tech.ChEMBL_437163 (CHEMBL906560)
IC50 10000±n/a nM
Citation Brizzi, ACascio, MGBrizzi, VBisogno, TDinatolo, MTMartinelli, ATuccinardi, TDi Marzo, V Design, synthesis, binding, and molecular modeling studies of new potent ligands of cannabinoid receptors. Bioorg Med Chem15:5406-16 (2007) 
 
Fatty-acid amide hydrolase 1 [30-579]
Name:Fatty-acid amide hydrolase 1 [30-579]
Type:Single-pass membrane protein; homodimer
Mol. Mass.:60474.00
Organism:Rattus norvegicus (rat)
Description:P97612 (aa 30-579)
Residue:550
BDBM50215246
NameBDBM50215246
Synonyms:11-(3-hydroxy-5-pentyl-phenoxy)-undecanoic acid (3-methoxy-4-hydroxy-phenyl)-amide | CHEMBL228403
TypeSmall organic molecule
Emp. Form.C30H45NO5
Mol. Mass.499.682
SMILESCCCCCc1cc(O)cc(OCCCCCCCCCCC(=O)NCc2ccc(OC)c(O)c2)c1