Reaction Details
TargetCannabinoid receptor 1
LigandBDBM50215233
Substrate/Competitorn/a
Meas. Tech.ChEMBL_437165 (CHEMBL906563)
IC50>10000±n/a nM
Citation Brizzi, ACascio, MGBrizzi, VBisogno, TDinatolo, MTMartinelli, ATuccinardi, TDi Marzo, V Design, synthesis, binding, and molecular modeling studies of new potent ligands of cannabinoid receptors. Bioorg Med Chem15:5406-16 (2007) 
 
Cannabinoid receptor 1
Name:Cannabinoid receptor 1
Type:G Protein-Coupled Receptor (GPCR)
Mol. Mass.:52868.96
Organism:Homo sapiens (Human)
Description:P21554
Residue:472
BDBM50215233
NameBDBM50215233
Synonyms:11-(4-hexyl-3-hydroxy-phenoxy)-undecanoic acid cyclopropylmethyl-amide | CHEMBL228566
TypeSmall organic molecule
Emp. Form.C27H45NO3
Mol. Mass.431.6511
SMILESCCCCCCc1ccc(OCCCCCCCCCCC(=O)NCC2CC2)cc1O