Reaction Details
TargetCannabinoid receptor 1
LigandBDBM50215240
Substrate/Competitorn/a
Meas. Tech.ChEMBL_437161 (CHEMBL906558)
Ki 16±n/a nM
Citation Brizzi, ACascio, MGBrizzi, VBisogno, TDinatolo, MTMartinelli, ATuccinardi, TDi Marzo, V Design, synthesis, binding, and molecular modeling studies of new potent ligands of cannabinoid receptors. Bioorg Med Chem15:5406-16 (2007) 
 
Cannabinoid receptor 1
Name:Cannabinoid receptor 1
Type:G Protein-Coupled Receptor (GPCR)
Mol. Mass.:52868.96
Organism:Homo sapiens (Human)
Description:P21554
Residue:472
BDBM50215240
NameBDBM50215240
Synonyms:8-(3-hydroxy-5-pentyl-phenoxy)-octanoic acid cyclopropylamide | CHEMBL228347
TypeSmall organic molecule
Emp. Form.C22H35NO3
Mol. Mass.361.5182
SMILESCCCCCc1cc(O)cc(OCCCCCCCC(=O)NC2CC2)c1