Reaction Details
TargetCannabinoid receptor 1
LigandBDBM50215246
Substrate/Competitorn/a
Meas. Tech.ChEMBL_437161 (CHEMBL906558)
Ki 2100±n/a nM
Citation Brizzi, ACascio, MGBrizzi, VBisogno, TDinatolo, MTMartinelli, ATuccinardi, TDi Marzo, V Design, synthesis, binding, and molecular modeling studies of new potent ligands of cannabinoid receptors. Bioorg Med Chem15:5406-16 (2007) 
 
Cannabinoid receptor 1
Name:Cannabinoid receptor 1
Type:G Protein-Coupled Receptor (GPCR)
Mol. Mass.:52868.96
Organism:Homo sapiens (Human)
Description:P21554
Residue:472
BDBM50215246
NameBDBM50215246
Synonyms:11-(3-hydroxy-5-pentyl-phenoxy)-undecanoic acid (3-methoxy-4-hydroxy-phenyl)-amide | CHEMBL228403
TypeSmall organic molecule
Emp. Form.C30H45NO5
Mol. Mass.499.682
SMILESCCCCCc1cc(O)cc(OCCCCCCCCCCC(=O)NCc2ccc(OC)c(O)c2)c1