Reaction Details
TargetCannabinoid receptor 1
LigandBDBM50215230
Substrate/Competitorn/a
Meas. Tech.ChEMBL_437161 (CHEMBL906558)
Ki 130±n/a nM
Citation Brizzi, ACascio, MGBrizzi, VBisogno, TDinatolo, MTMartinelli, ATuccinardi, TDi Marzo, V Design, synthesis, binding, and molecular modeling studies of new potent ligands of cannabinoid receptors. Bioorg Med Chem15:5406-16 (2007) 
 
Cannabinoid receptor 1
Name:Cannabinoid receptor 1
Type:G Protein-Coupled Receptor (GPCR)
Mol. Mass.:52868.96
Organism:Homo sapiens (Human)
Description:P21554
Residue:472
BDBM50215230
NameBDBM50215230
Synonyms:8-(3-hydroxy-5-pentyl-phenoxy)-octanoic acid (2-hydroxy-ethyl)-amide | CHEMBL228346
TypeSmall organic molecule
Emp. Form.C21H35NO4
Mol. Mass.365.5069
SMILESCCCCCc1cc(O)cc(OCCCCCCCC(=O)NCCO)c1