Reaction Details
TargetFatty-acid amide hydrolase 1 [30-579]
LigandBDBM50215239
Substrate/Competitorn/a
Meas. Tech.ChEMBL_437163 (CHEMBL906560)
IC50 50000±n/a nM
Citation Brizzi, ACascio, MGBrizzi, VBisogno, TDinatolo, MTMartinelli, ATuccinardi, TDi Marzo, V Design, synthesis, binding, and molecular modeling studies of new potent ligands of cannabinoid receptors. Bioorg Med Chem15:5406-16 (2007) 
 
Fatty-acid amide hydrolase 1 [30-579]
Name:Fatty-acid amide hydrolase 1 [30-579]
Type:Single-pass membrane protein; homodimer
Mol. Mass.:60474.00
Organism:Rattus norvegicus (rat)
Description:P97612 (aa 30-579)
Residue:550
BDBM50215239
NameBDBM50215239
Synonyms:12-(2-hexyl-5-hydroxy-phenoxy)-dodecanoic acid(2-hydroxy-ethyl)-amide | CHEMBL228508
TypeSmall organic molecule
Emp. Form.C26H45NO4
Mol. Mass.435.6398
SMILESCCCCCCc1c(O)cccc1OCCCCCCCCCCCC(=O)NCCO