Reaction Details
TargetAmine oxidase [flavin-containing] A
LigandBDBM50217374
Substrate/Competitorn/a
Meas. Tech.ChEMBL_437312 (CHEMBL906712)
Ki 13220±n/a nM
Citation Gökhan-Kelekçi, NYabanoglu, SKüpeli, ESalgin, UOzgen, OUçar, GYesilada, EKendi, EYesilada, ABilgin, AA A new therapeutic approach in Alzheimer disease: some novel pyrazole derivatives as dual MAO-B inhibitors and antiinflammatory analgesics. Bioorg Med Chem15:5775-86 (2007) 
 
Amine oxidase [flavin-containing] A
Name:Amine oxidase [flavin-containing] A
Type:Enzyme
Mol. Mass.:59515.21
Organism:Rattus norvegicus (rat)
Description:n/a
Residue:526
BDBM50217374
NameBDBM50217374
Synonyms:3-(4-chlorophenyl)-N-methyl-5-(1H-pyrrol-2-yl)-4,5-dihydropyrazole-1-carbothioamide | CHEMBL229500
TypeSmall organic molecule
Emp. Form.C15H15ClN4S
Mol. Mass.318.824
SMILESCNC(=S)N1N=C(CC1c1ccc[nH]1)c1ccc(Cl)cc1