Reaction Details
TargetfMet-Leu-Phe receptor
LigandBDBM50211800
Substrate/Competitorn/a
Meas. Tech.ChEMBL_438742 (CHEMBL887899)
Ki>10000±n/a nM
Citation Bruno, OBrullo, CBondavalli, FRanise, ASchenone, SFalzarano, MSVarani, KSpisani, S 2-Phenyl-2,3-dihydro-1H-imidazo[1,2-b]pyrazole derivatives: new potent inhibitors of fMLP-induced neutrophil chemotaxis. Bioorg Med Chem Lett17:3696-701 (2007) 
 
fMet-Leu-Phe receptor
Name:fMet-Leu-Phe receptor
Type:Enzyme Catalytic Domain
Mol. Mass.:38456.14
Organism:Homo sapiens (Human)
Description:gi_4503779
Residue:350
BDBM50211800
NameBDBM50211800
Synonyms:CHEMBL231427 | N-cyclopropyl-2-phenyl-2,3-dihydro-1H-imidazo[1,2-b]pyrazole-7-carboxamide
TypeSmall organic molecule
Emp. Form.C15H16N4O
Mol. Mass.268.3137
SMILESO=C(NC1CC1)c1cnn2CC(Nc12)c1ccccc1