Reaction Details
TargetAcyl-CoA desaturase 1
LigandBDBM50371060
Substrate/Competitorn/a
Meas. Tech.ChEMBL_438936 (CHEMBL889279)
IC50 4.5±n/a nM
Citation Liu, GLynch, JKFreeman, JLiu, BXin, ZZhao, HSerby, MDKym, PRSuhar, TSSmith, HTCao, NYang, RJanis, RSKrauser, JACepa, SPBeno, DWSham, HLCollins, CASurowy, TKCamp, HS Discovery of potent, selective, orally bioavailable stearoyl-CoA desaturase 1 inhibitors. J Med Chem50:3086-100 (2007) 
 
Acyl-CoA desaturase 1
Name:Acyl-CoA desaturase 1
Type:PROTEIN
Mol. Mass.:41064.54
Organism:Mus musculus
Description:ChEMBL_1462109
Residue:355
BDBM50371060
NameBDBM50371060
Synonyms:CHEMBL226646
TypeSmall organic molecule
Emp. Form.C18H17ClFN5O2
Mol. Mass.389.811
SMILESCc1nnc(o1)-c1ccc(nn1)N1CCC(CC1)Oc1cc(F)ccc1Cl