Reaction Details
TargetAcyl-CoA desaturase 1
LigandBDBM50371087
Substrate/Competitorn/a
Meas. Tech.ChEMBL_438936 (CHEMBL889279)
IC50 4±n/a nM
Citation Liu, GLynch, JKFreeman, JLiu, BXin, ZZhao, HSerby, MDKym, PRSuhar, TSSmith, HTCao, NYang, RJanis, RSKrauser, JACepa, SPBeno, DWSham, HLCollins, CASurowy, TKCamp, HS Discovery of potent, selective, orally bioavailable stearoyl-CoA desaturase 1 inhibitors. J Med Chem50:3086-100 (2007) 
 
Acyl-CoA desaturase 1
Name:Acyl-CoA desaturase 1
Type:PROTEIN
Mol. Mass.:41064.54
Organism:Mus musculus
Description:ChEMBL_1462109
Residue:355
BDBM50371087
NameBDBM50371087
Synonyms:CHEMBL375514
TypeSmall organic molecule
Emp. Form.C18H18ClFN6O
Mol. Mass.388.827
SMILESCc1nnc([nH]1)-c1ccc(nn1)N1CCC(CC1)Oc1cc(F)ccc1Cl