Reaction Details
TargetT-cell surface glycoprotein CD4
LigandBDBM50217026
Substrate/Competitorn/a
Meas. Tech.ChEMBL_440402 (CHEMBL890716)
Kd 6000±n/a nM
Citation Neffe, ATBilang, MGrüneberg, IMeyer, B Rational optimization of the binding affinity of CD4 targeting peptidomimetics with potential anti HIV activity. J Med Chem50:3482-8 (2007) 
 
T-cell surface glycoprotein CD4
Name:T-cell surface glycoprotein CD4
Type:PROTEIN
Mol. Mass.:51136.66
Organism:Homo sapiens (Human)
Description:ChEMBL_440402
Residue:458
BDBM50217026
NameBDBM50217026
Synonyms:CHEMBL230798 | tert-Butyl-carbamic acid (S)-1-{(2S,3S)-2-[2-((S)-2-{(S)-6-amino-2-[2-(naphthalen-2-yloxy)-acetylamino]-hexanoylamino}-3-methyl-butyrylamino)-acetylamino]-3-hydroxy-butyryl}-pyrrolidin-2-ylmethyl ester
TypeSmall organic molecule
Emp. Form.C39H59N7O9
Mol. Mass.769.9273
SMILESCC(C)[C@H](NC(=O)[C@H](CCCCN)NC(=O)COc1ccc2ccccc2c1)C(=O)NCC(=O)N[C@@H]([C@H](C)O)C(=O)N1CCC[C@H]1COC(=O)NC(C)(C)C