Reaction Details
TargetApoptosis regulator Bcl-2
LigandBDBM50202271
Substrate/Competitorn/a
Meas. Tech.ChEMBL_441637 (CHEMBL891868)
Ki 1950±n/a nM
Citation Xing, CWang, LTang, XSham, YY Development of selective inhibitors for anti-apoptotic Bcl-2 proteins from BHI-1. Bioorg Med Chem15:2167-76 (2007) 
 
Apoptosis regulator Bcl-2
Name:Apoptosis regulator Bcl-2
Type:Homodimer or heterodimer
Mol. Mass.:26269.11
Organism:Homo sapiens (Human)
Description:P10415
Residue:239
BDBM50202271
NameBDBM50202271
Synonyms:2-[5-(phenyl(4-biphenyl)methylidene)-4-oxo-2-thioxothiazolidin-3-yl]-4-methylpentanoic acid | CHEMBL242340
TypeSmall organic molecule
Emp. Form.C28H25NO3S2
Mol. Mass.487.633
SMILESCC(C)C[C@H](N1C(=S)S\C(=C(\c2ccccc2)c2ccc(cc2)-c2ccccc2)C1=O)C(O)=O