Reaction Details
TargetBcl-2-like protein 2
LigandBDBM50202282
Substrate/Competitorn/a
Meas. Tech.ChEMBL_441639 (CHEMBL891870)
Ki 58300±n/a nM
Citation Xing, CWang, LTang, XSham, YY Development of selective inhibitors for anti-apoptotic Bcl-2 proteins from BHI-1. Bioorg Med Chem15:2167-76 (2007) 
 
Bcl-2-like protein 2
Name:Bcl-2-like protein 2
Type:Protein
Mol. Mass.:20742.61
Organism:Homo sapiens (Human)
Description:n/a
Residue:193
BDBM50202282
NameBDBM50202282
Synonyms:2-[5-(1-phenylethylidene)-4-oxo-2-thioxothiazolidin-3-yl]-4-methylpentanoic acid | CHEMBL242339
TypeSmall organic molecule
Emp. Form.C17H19NO3S2
Mol. Mass.349.468
SMILESCC(C)C[C@H](N1C(=S)S\C(=C(\C)c2ccccc2)C1=O)C(O)=O