Reaction Details
TargetApoptosis regulator Bcl-2
LigandBDBM50202282
Substrate/Competitorn/a
Meas. Tech.ChEMBL_441637 (CHEMBL891868)
Ki 21200±n/a nM
Citation Xing, CWang, LTang, XSham, YY Development of selective inhibitors for anti-apoptotic Bcl-2 proteins from BHI-1. Bioorg Med Chem15:2167-76 (2007) 
 
Apoptosis regulator Bcl-2
Name:Apoptosis regulator Bcl-2
Type:Homodimer or heterodimer
Mol. Mass.:26269.11
Organism:Homo sapiens (Human)
Description:P10415
Residue:239
BDBM50202282
NameBDBM50202282
Synonyms:2-[5-(1-phenylethylidene)-4-oxo-2-thioxothiazolidin-3-yl]-4-methylpentanoic acid | CHEMBL242339
TypeSmall organic molecule
Emp. Form.C17H19NO3S2
Mol. Mass.349.468
SMILESCC(C)C[C@H](N1C(=S)S\C(=C(\C)c2ccccc2)C1=O)C(O)=O