Reaction Details
TargetBcl-2-like protein 2
LigandBDBM50202276
Substrate/Competitorn/a
Meas. Tech.ChEMBL_441639 (CHEMBL891870)
Ki 116000±n/a nM
Citation Xing, CWang, LTang, XSham, YY Development of selective inhibitors for anti-apoptotic Bcl-2 proteins from BHI-1. Bioorg Med Chem15:2167-76 (2007) 
 
Bcl-2-like protein 2
Name:Bcl-2-like protein 2
Type:Protein
Mol. Mass.:20742.61
Organism:Homo sapiens (Human)
Description:n/a
Residue:193
BDBM50202276
NameBDBM50202276
Synonyms:2-propenyl 2-[5-biphenylmethylidene-4-oxo-2-thioxothiazolidin-3-yl]-3-phenylpropanoate | CHEMBL396500
TypeSmall organic molecule
Emp. Form.C28H23NO3S2
Mol. Mass.485.617
SMILES[#6]=[#6]-[#6]-[#8]-[#6](=O)-[#6@H](-[#6]-c1ccccc1)-[#7]-1-[#6](=S)-[#16]\[#6](=[#6](/c2ccccc2)-c2ccccc2)-[#6]-1=O