Reaction Details
TargetCarbonic anhydrase 2
LigandBDBM50027536
Substrate/Competitorn/a
Meas. Tech.ChEMBL_442424 (CHEMBL891631)
Ki 14200000±n/a nM
Citation Temperini, CInnocenti, AGuerri, AScozzafava, ARusconi, SSupuran, CT Phosph(on)ate as a zinc-binding group in metalloenzyme inhibitors: X-ray crystal structure of the antiviral drug foscarnet complexed to human carbonic anhydrase I. Bioorg Med Chem Lett17:2210-5 (2007) 
 
Carbonic anhydrase 2
Name:Carbonic anhydrase 2
Type:Enzyme
Mol. Mass.:29250.71
Organism:Homo sapiens (Human)
Description:P00918
Residue:260
BDBM50027536
NameBDBM50027536
Synonyms:(phosphonoformate)Trisodium phosphonoformate CHEMBL754 FOSCARNET SODIUM Foscavir trisodium dioxidophosphinecarboxylate oxide trisodium phosphonoformate
TypeSmall organic molecule
Emp. Form.CO5P
Mol. Mass.122.9831
SMILES[O-]C(=O)P([O-])([O-])=O