Reaction Details
TargetCarbonic anhydrase 5A, mitochondrial
LigandBDBM50027536
Substrate/Competitorn/a
Meas. Tech.ChEMBL_442426 (CHEMBL892591)
Ki 41700000±n/a nM
Citation Temperini, CInnocenti, AGuerri, AScozzafava, ARusconi, SSupuran, CT Phosph(on)ate as a zinc-binding group in metalloenzyme inhibitors: X-ray crystal structure of the antiviral drug foscarnet complexed to human carbonic anhydrase I. Bioorg Med Chem Lett17:2210-5 (2007) 
 
Carbonic anhydrase 5A, mitochondrial
Name:Carbonic anhydrase 5A, mitochondrial
Type:Enzyme
Mol. Mass.:34755.54
Organism:Homo sapiens (Human)
Description:Human (cloned) isozyme
Residue:305
BDBM50027536
NameBDBM50027536
Synonyms:(phosphonoformate)Trisodium phosphonoformate CHEMBL754 FOSCARNET SODIUM Foscavir trisodium dioxidophosphinecarboxylate oxide trisodium phosphonoformate
TypeSmall organic molecule
Emp. Form.CO5P
Mol. Mass.122.9831
SMILES[O-]C(=O)P([O-])([O-])=O