Reaction Details
TargetNitric oxide synthase, brain
LigandBDBM50206074
Substrate/Competitorn/a
Meas. Tech.ChEMBL_442514 (CHEMBL892679)
IC50 30±n/a nM
Citation Patman, JBhardwaj, NRamnauth, JAnnedi, SCRenton, PMaddaford, SPRakhit, SAndrews, JS Novel 2-aminobenzothiazoles as selective neuronal nitric oxide synthase inhibitors. Bioorg Med Chem Lett17:2540-4 (2007) 
 
Nitric oxide synthase, brain
Name:Nitric oxide synthase, brain
Type:Homodimer
Mol. Mass.:160985.98
Organism:Homo sapiens (Human)
Description:P29475
Residue:1434
BDBM50206074
NameBDBM50206074
Synonyms:(+/-)-N-{2-[2-(1-methyl-pyrrolidin-2-yl)-ethylamino]-benzothiazol-5-yl}-thiophene-2-carboxamidine | CHEMBL397446
TypeSmall organic molecule
Emp. Form.C19H23N5S2
Mol. Mass.385.549
SMILESCN1CCCC1CCNc1nc2cc(ccc2s1)N=C(N)c1cccs1