Reaction Details
TargetNitric oxide synthase, brain
LigandBDBM50206065
Substrate/Competitorn/a
Meas. Tech.ChEMBL_442514 (CHEMBL892679)
IC50 100±n/a nM
Citation Patman, JBhardwaj, NRamnauth, JAnnedi, SCRenton, PMaddaford, SPRakhit, SAndrews, JS Novel 2-aminobenzothiazoles as selective neuronal nitric oxide synthase inhibitors. Bioorg Med Chem Lett17:2540-4 (2007) 
 
Nitric oxide synthase, brain
Name:Nitric oxide synthase, brain
Type:Homodimer
Mol. Mass.:160985.98
Organism:Homo sapiens (Human)
Description:P29475
Residue:1434
BDBM50206065
NameBDBM50206065
Synonyms:CHEMBL233655 | N-{2-[1-(3-methoxy-benzyl)-piperidin-4-ylamino]-benzothiazol-6-yl}-thiophene-2-carboxamidine
TypeSmall organic molecule
Emp. Form.C25H27N5OS2
Mol. Mass.477.645
SMILESCOc1cccc(CN2CCC(CC2)Nc2nc3ccc(cc3s2)N=C(N)c2cccs2)c1