Reaction Details
TargetLow molecular weight phosphotyrosine protein phosphatase
LigandBDBM38435
Substrate/Competitorn/a
Meas. Tech.ChEMBL_443204 (CHEMBL893452)
Ki 610000±n/a nM
Citation Vidal, DBlobel, JPérez, YThormann, MPons, M Structure-based discovery of new small molecule inhibitors of low molecular weight protein tyrosine phosphatase. Eur J Med Chem42:1102-8 (2007) 
 
Low molecular weight phosphotyrosine protein phosphatase
Name:Low molecular weight phosphotyrosine protein phosphatase
Type:PROTEIN
Mol. Mass.:18055.33
Organism:Bos taurus
Description:ChEMBL_857178
Residue:158
BDBM38435
NameBDBM38435
Synonyms:9-ethyl-1-oxo-2,3,4,9-tetrahydro-1H-carbazole-6-carboxylic acid 9-ethyl-8-oxidanylidene-6,7-dihydro-5H-carbazole-3-carboxylic acid MLS000061864 cid_768661
TypeSmall organic molecule
Emp. Form.C15H15NO3
Mol. Mass.257.2845
SMILESCCn1c2c(CCCC2=O)c2cc(ccc12)C(O)=O