Reaction Details
TargetLow molecular weight phosphotyrosine protein phosphatase
LigandBDBM50371123
Substrate/Competitorn/a
Meas. Tech.ChEMBL_443204 (CHEMBL893452)
Ki 240000±n/a nM
Citation Vidal, DBlobel, JPérez, YThormann, MPons, M Structure-based discovery of new small molecule inhibitors of low molecular weight protein tyrosine phosphatase. Eur J Med Chem42:1102-8 (2007) 
 
Low molecular weight phosphotyrosine protein phosphatase
Name:Low molecular weight phosphotyrosine protein phosphatase
Type:PROTEIN
Mol. Mass.:18055.33
Organism:Bos taurus
Description:ChEMBL_857178
Residue:158
BDBM50371123
NameBDBM50371123
Synonyms:CHEMBL244090
TypeSmall organic molecule
Emp. Form.C12H11NO2S
Mol. Mass.233.286
SMILESOC(=O)c1ccc2[nH]c3CCSCc3c2c1