Reaction Details
TargetTyrosine-protein kinase Lyn
LigandBDBM50178611
Substrate/Competitorn/a
Meas. Tech.ChEMBL_443314 (CHEMBL892515)
IC50 3.1±n/a nM
Citation Horio, THamasaki, TInoue, TWakayama, TItou, SNaito, HAsaki, THayase, HNiwa, T Structural factors contributing to the Abl/Lyn dual inhibitory activity of 3-substituted benzamide derivatives. Bioorg Med Chem Lett17:2712-7 (2007) 
 
Tyrosine-protein kinase Lyn
Name:Tyrosine-protein kinase Lyn
Type:Protein
Mol. Mass.:58575.92
Organism:Homo sapiens (Human)
Description:P07948
Residue:512
BDBM50178611
NameBDBM50178611
Synonyms:3-bromo-N-(4-methyl-3-(4-(pyridin-3-yl)pyrimidin-2-ylamino)phenyl)-4-((4-methylpiperazin-1-yl)methyl)benzamide | CHEMBL383010
TypeSmall organic molecule
Emp. Form.C29H30BrN7O
Mol. Mass.572.499
SMILESCN1CCN(Cc2ccc(cc2Br)C(=O)Nc2ccc(C)c(Nc3nccc(n3)-c3cccnc3)c2)CC1