Reaction Details
TargetTyrosine-protein kinase Lyn
LigandBDBM50208748
Substrate/Competitorn/a
Meas. Tech.ChEMBL_443314 (CHEMBL892515)
IC50 7.6±n/a nM
Citation Horio, THamasaki, TInoue, TWakayama, TItou, SNaito, HAsaki, THayase, HNiwa, T Structural factors contributing to the Abl/Lyn dual inhibitory activity of 3-substituted benzamide derivatives. Bioorg Med Chem Lett17:2712-7 (2007) 
 
Tyrosine-protein kinase Lyn
Name:Tyrosine-protein kinase Lyn
Type:Protein
Mol. Mass.:58575.92
Organism:Homo sapiens (Human)
Description:P07948
Residue:512
BDBM50208748
NameBDBM50208748
Synonyms:(4-(((S)-3-((dimethylamino)methyl)pyrrolidin-1-yl)methyl)-3-(trifluoromethyl)phenyl)(4-methyl-3-(4-(pyrimidin-5-yl)pyrimidin-2-ylamino)phenylamino)methanol hydrochloride | CHEMBL538337
TypeSmall organic molecule
Emp. Form.C31H35F3N8O
Mol. Mass.592.6578
SMILESCN(C)C[C@@H]1CCN(Cc2ccc(cc2C(F)(F)F)C(O)Nc2ccc(C)c(Nc3nccc(n3)-c3cncnc3)c2)C1