Reaction Details
TargetMu-type opioid receptor
LigandBDBM50209307
Substrate/Competitorn/a
Meas. Tech.ChEMBL_443502 (CHEMBL893760)
IC50 2.74±n/a nM
Citation Honda, TShirasu, NIsozaki, KKawano, MShigehiro, DChuman, YFujita, TNose, TShimohigashi, Y Differential receptor binding characteristics of consecutive phenylalanines in micro-opioid specific peptide ligand endomorphin-2. Bioorg Med Chem15:3883-8 (2007) 
 
Mu-type opioid receptor
Name:Mu-type opioid receptor
Type:G Protein-Coupled Receptor (GPCR)
Mol. Mass.:44503.11
Organism:Rattus norvegicus (rat)
Description:Competition binding assays were carried out using membrane preparations from transfected HN9.10 cells that constitutively expressed the mu opioid receptor.
Residue:398
BDBM50209307
NameBDBM50209307
Synonyms:(S)-N-((S)-1-((S)-1-amino-1-oxo-3-(perfluorophenyl)propan-2-ylamino)-1-oxo-3-phenylpropan-2-yl)-1-((S)-2-amino-3-(4-hydroxyphenyl)propanoyl)pyrrolidine-2-carboxamide | CHEMBL242980
TypeSmall organic molecule
Emp. Form.C32H32F5N5O5
Mol. Mass.661.619
SMILESN[C@@H](Cc1ccc(O)cc1)C(=O)N1CCC[C@H]1C(=O)N[C@@H](Cc1ccccc1)C(=O)N[C@@H](Cc1c(F)c(F)c(F)c(F)c1F)C(N)=O