Reaction Details
TargetMu-type opioid receptor
LigandBDBM50095155
Substrate/Competitorn/a
Meas. Tech.ChEMBL_443502 (CHEMBL893760)
IC50 1.89±n/a nM
Citation Honda, TShirasu, NIsozaki, KKawano, MShigehiro, DChuman, YFujita, TNose, TShimohigashi, Y Differential receptor binding characteristics of consecutive phenylalanines in micro-opioid specific peptide ligand endomorphin-2. Bioorg Med Chem15:3883-8 (2007) 
 
Mu-type opioid receptor
Name:Mu-type opioid receptor
Type:G Protein-Coupled Receptor (GPCR)
Mol. Mass.:44503.11
Organism:Rattus norvegicus (rat)
Description:Competition binding assays were carried out using membrane preparations from transfected HN9.10 cells that constitutively expressed the mu opioid receptor.
Residue:398
BDBM50095155
NameBDBM50095155
Synonyms:(S)-1-[(S)-2-Amino-3-(4-hydroxy-phenyl)-propionyl]-pyrrolidine-2-carboxylic acid [(S)-1-((S)-1-carbamoyl-2-phenyl-ethylcarbamoyl)-2-(1H-indol-3-yl)-ethyl]-amide 1-[(S)-2-Amino-3-(4-hydroxy-phenyl)-propionyl]-pyrrolidine-2-carboxylic acid [1-((S)-(S)-1-carbamoyl-2-phenyl-ethylcarbamoyl)-2-(1H-indol-3-yl)-ethyl]-amide CHEMBL316446 H-Tyr-Pro-Trp-Phe-NH2 YPWF-NH2 | endomorphin -1
TypeSmall organic molecule
Emp. Form.C34H38N6O5
Mol. Mass.610.7027
SMILESN[C@@H](Cc1ccc(O)cc1)C(=O)N1CCC[C@H]1C(=O)N[C@@H](Cc1c[nH]c2ccccc12)C(=O)N[C@@H](Cc1ccccc1)C(N)=O