Reaction Details
Target5-hydroxytryptamine receptor 4
LigandBDBM29525
Substrate/Competitorn/a
Meas. Tech.ChEMBL_445413 (CHEMBL895705)
Ki 0.7±n/a nM
Citation Russo, OBerthouze, MGiner, MSoulier, JLRivail, LSicsic, SLezoualc'h, FJockers, RBerque-Bestel, I Synthesis of specific bivalent probes that functionally interact with 5-HT(4) receptor dimers. J Med Chem50:4482-92 (2007) 
 
5-hydroxytryptamine receptor 4
Name:5-hydroxytryptamine receptor 4
Type:Enzyme
Mol. Mass.:43767.54
Organism:Homo sapiens (Human)
Description:Q13639
Residue:388
BDBM29525
NameBDBM29525
Synonyms:3H-GR113808 GR 113808 [3H]GR113808
Typeradiolabeled ligand
Emp. Form.C19H27N3O4S
Mol. Mass.393.5
SMILESCn1cc(C(=O)OCC2CCN(CCNS(C)(=O)=O)CC2)c2ccccc12