Reaction Details
TargetBeta-2 adrenergic receptor
LigandBDBM50221773
Substrate/Competitorn/a
Meas. Tech.ChEMBL_446237 (CHEMBL895342)
EC50 1200±n/a nM
Citation Buonsanti, MFBertinaria, MStilo, ADCena, CFruttero, RGasco, A Nitric oxide donor beta2-agonists: furoxan derivatives containing the fenoterol moiety and related furazans. J Med Chem50:5003-11 (2007) 
 
Beta-2 adrenergic receptor
Name:Beta-2 adrenergic receptor
Type:PROTEIN
Mol. Mass.:46896.26
Organism:Rattus norvegicus
Description:ChEMBL_38603
Residue:418
BDBM50221773
NameBDBM50221773
Synonyms:4-(4-{2-[2-(3,5-dihydroxy-phenyl)-2-hydroxy-ethylamino]-propyl}-phenoxymethyl)-2-oxy-furazan-3-carboxylic acid amide rac-4-(4-{(2R)-[2-(3,5-dihydroxyphenyl)-(2S)-hydroxyethylamino]propyl}phenoxymethyl)furoxan-3-carboxamide
TypeSmall organic molecule
Emp. Form.C21H24N4O7
Mol. Mass.444.4379
SMILESCC(Cc1ccc(OCc2no[n+]([O-])c2C(N)=O)cc1)NCC(O)c1cc(O)cc(O)c1