Reaction Details
TargetDelta-type opioid receptor
LigandBDBM50027242
Substrate/Competitorn/a
Meas. Tech.ChEMBL_446659 (CHEMBL896954)
Ki 5.4±n/a nM
Citation Rennison, DNeal, APCami-Kobeci, GAceto, MDMartinez-Bermejo, FLewis, JWHusbands, SM Cinnamoyl derivatives of 7alpha-aminomethyl-6,14-endo-ethanotetrahydrothebaine and 7alpha-aminomethyl-6,14-endo-ethanotetrahydrooripavine and related opioid ligands. J Med Chem50:5176-82 (2007) 
 
Delta-type opioid receptor
Name:Delta-type opioid receptor
Type:G Protein-Coupled Receptor (GPCR)
Mol. Mass.:40382.98
Organism:Homo sapiens (Human)
Description:Competition binding assays were carried out using membrane preparations from transfected HN9.10 cells that constitutively expressed the delta opioid receptor.
Residue:372
BDBM50027242
NameBDBM50027242
Synonyms:CHEMBL2113308
TypeSmall organic molecule
Emp. Form.C30H33N3O6
Mol. Mass.531.5995
SMILES[H][C@@]12Oc3c4c(C[C@@]5([H])N(C)CC[C@@]14[C@@]51CC[C@]2(OC)[C@@H](CNC(=O)\C=C\c2ccc(cc2)[N+]([O-])=O)C1)ccc3O