Reaction Details
TargetMu-type opioid receptor
LigandBDBM50027254
Substrate/Competitorn/a
Meas. Tech.ChEMBL_446657 (CHEMBL896952)
Ki 0.740000±n/a nM
Citation Rennison, DNeal, APCami-Kobeci, GAceto, MDMartinez-Bermejo, FLewis, JWHusbands, SM Cinnamoyl derivatives of 7alpha-aminomethyl-6,14-endo-ethanotetrahydrothebaine and 7alpha-aminomethyl-6,14-endo-ethanotetrahydrooripavine and related opioid ligands. J Med Chem50:5176-82 (2007) 
 
Mu-type opioid receptor
Name:Mu-type opioid receptor
Type:G Protein-Coupled Receptor (GPCR)
Mol. Mass.:44789.51
Organism:Homo sapiens (Human)
Description:P35372
Residue:400
BDBM50027254
NameBDBM50027254
Synonyms:CHEMBL2113295
TypeSmall organic molecule
Emp. Form.C32H38N2O4
Mol. Mass.514.6551
SMILES[H][C@@]12Oc3c4c(C[C@@]5([H])N(C)CC[C@@]14[C@@]51CC[C@]2(OC)[C@@H](CNC(=O)\C=C\c2ccccc2C)C1)ccc3OC