Reaction Details
TargetKappa-type opioid receptor
LigandBDBM50027238
Substrate/Competitorn/a
Meas. Tech.ChEMBL_446658 (CHEMBL896953)
Ki 5.3±n/a nM
Citation Rennison, DNeal, APCami-Kobeci, GAceto, MDMartinez-Bermejo, FLewis, JWHusbands, SM Cinnamoyl derivatives of 7alpha-aminomethyl-6,14-endo-ethanotetrahydrothebaine and 7alpha-aminomethyl-6,14-endo-ethanotetrahydrooripavine and related opioid ligands. J Med Chem50:5176-82 (2007) 
 
Kappa-type opioid receptor
Name:Kappa-type opioid receptor
Type:G Protein-Coupled Receptor (GPCR)
Mol. Mass.:42648.76
Organism:Homo sapiens (Human)
Description:P41145
Residue:380
BDBM50027238
NameBDBM50027238
Synonyms:CHEMBL2113303
TypeSmall organic molecule
Emp. Form.C30H34N2O4
Mol. Mass.486.602
SMILES[H][C@@]12Oc3c4c(C[C@@]5([H])N(C)CC[C@@]14[C@@]51CC[C@]2(OC)[C@@H](CNC(=O)\C=C\c2ccccc2)C1)ccc3O