Reaction Details
TargetLow molecular weight phosphotyrosine protein phosphatase
LigandBDBM50214530
Substrate/Competitorn/a
Meas. Tech.ChEMBL_448046 (CHEMBL898301)
IC50 900±n/a nM
Citation Maccari, RPaoli, POttanà, RJacomelli, MCiurleo, RManao, GSteindl, TLanger, TVigorita, MGCamici, G 5-Arylidene-2,4-thiazolidinediones as inhibitors of protein tyrosine phosphatases. Bioorg Med Chem15:5137-49 (2007) 
 
Low molecular weight phosphotyrosine protein phosphatase
Name:Low molecular weight phosphotyrosine protein phosphatase
Type:n/a
Mol. Mass.:18042.81
Organism:Homo sapiens (Human)
Description:P24666
Residue:158
BDBM50214530
NameBDBM50214530
Synonyms:4-[2,4-dioxo-5-(4-phenoxybenzylidene)thiazolidin-3-yl]methylbenzoic acid | CHEMBL393606
TypeSmall organic molecule
Emp. Form.C24H17NO5S
Mol. Mass.431.46
SMILESOC(=O)c1ccc(CN2C(=O)S\C(=C/c3ccc(Oc4ccccc4)cc3)C2=O)cc1