Reaction Details
TargetMineralocorticoid receptor
LigandBDBM50219449
Substrate/Competitorn/a
Meas. Tech.ChEMBL_448944 (CHEMBL899207)
IC50 345±n/a nM
Citation Kuzmich, DKirrane, TProudfoot, JBekkali, YZindell, RBeck, LNelson, RShih, CKKukulka, AJPaw, ZReilly, PDeleon, RCardozo, MNabozny, GThomson, D Identification of dissociated non-steroidal glucocorticoid receptor agonists. Bioorg Med Chem Lett17:5025-31 (2007) 
 
Mineralocorticoid receptor
Name:Mineralocorticoid receptor
Type:Enzyme
Mol. Mass.:107076.42
Organism:Homo sapiens (Human)
Description:P08235
Residue:984
BDBM50219449
NameBDBM50219449
Synonyms:3-chloro-4-(4-(5-fluoro-2-methoxyphenyl)-2-hydroxy-4-methyl-2-(trifluoromethyl)pentyl)benzaldehyde | CHEMBL392289
TypeSmall organic molecule
Emp. Form.C21H21ClF4O3
Mol. Mass.432.836
SMILESCOc1ccc(F)cc1C(C)(C)CC(O)(Cc1ccc(C=O)cc1Cl)C(F)(F)F