Reaction Details
TargetMineralocorticoid receptor
LigandBDBM50219453
Substrate/Competitorn/a
Meas. Tech.ChEMBL_448944 (CHEMBL899207)
IC50 430±n/a nM
Citation Kuzmich, DKirrane, TProudfoot, JBekkali, YZindell, RBeck, LNelson, RShih, CKKukulka, AJPaw, ZReilly, PDeleon, RCardozo, MNabozny, GThomson, D Identification of dissociated non-steroidal glucocorticoid receptor agonists. Bioorg Med Chem Lett17:5025-31 (2007) 
 
Mineralocorticoid receptor
Name:Mineralocorticoid receptor
Type:Enzyme
Mol. Mass.:107076.42
Organism:Homo sapiens (Human)
Description:P08235
Residue:984
BDBM50219453
NameBDBM50219453
Synonyms:4-(4-(5-fluoro-2-methoxyphenyl)-2-hydroxy-4-methyl-2-(trifluoromethyl)pentyl)-1-naphthonitrile | CHEMBL392500
TypeSmall organic molecule
Emp. Form.C25H23F4NO2
Mol. Mass.445.4492
SMILESCOc1ccc(F)cc1C(C)(C)CC(O)(Cc1ccc(C#N)c2ccccc12)C(F)(F)F