Reaction Details
TargetGlucocorticoid receptor
LigandBDBM50219460
Substrate/Competitorn/a
Meas. Tech.ChEMBL_448942 (CHEMBL899205)
IC50 60±n/a nM
Citation Kuzmich, DKirrane, TProudfoot, JBekkali, YZindell, RBeck, LNelson, RShih, CKKukulka, AJPaw, ZReilly, PDeleon, RCardozo, MNabozny, GThomson, D Identification of dissociated non-steroidal glucocorticoid receptor agonists. Bioorg Med Chem Lett17:5025-31 (2007) 
 
Glucocorticoid receptor
Name:Glucocorticoid receptor
Type:Enzyme
Mol. Mass.:85656.87
Organism:Homo sapiens (Human)
Description:P04150
Residue:777
BDBM50219460
NameBDBM50219460
Synonyms:2-(3,5-dichlorobenzyl)-1,1,1-trifluoro-4-(5-fluoro-2-methoxyphenyl)-4-methylpentan-2-ol | CHEMBL235480
TypeSmall organic molecule
Emp. Form.C20H20Cl2F4O2
Mol. Mass.439.271
SMILESCOc1ccc(F)cc1C(C)(C)CC(O)(Cc1cc(Cl)cc(Cl)c1)C(F)(F)F